{"text_format":"2","workbook":"xlsx","n_sheets":2,"sheets":["공지"," 원본"],"not_rendered":{"charts":0,"images":0,"macros":0,"external_links":1,"defined_names":4,"comments":0,"pivot_tables":0},"unopened":[],"bounds":{"document_bytes":16777216,"sheet_cells":100000,"run_cost":"one","rows_first":2000,"rows_last":500,"rows_between":2000,"halvings":0,"cell_chars":16384,"cell_head_chars":4096},"cells_cut":0,"cells_raw":0,"read":"whole","date_system":"1900"}

{"sheet":"공지","index":0,"n_rows":150,"n_cols":18,"rows_kept":150,"cut":false,"hidden":false,"merged":[[0,1,0,17]]}
[null,"2025학년도 여름 계절학기 잔여석 현황"]
[{"$nulls":17},"2024.6.23. 10:20"]
[null,"순번","교과목구분","교과목영역","개설학과/전공","학수번호","분반","교과목명","교수명","학점","시간","교시","강의실","수업유형","본교생\n제한인원","본교생\n수강인원","본교생\n잔여석","비고"]
[null,1,"교양","이화진선미","기독교학과",10023,"01","기독교와세계","정혜진",3,3,2,"학109","대면수업",100,99,1,""]
[null,2,"교양","핵심교양(인간과사회)","법학과(법학전문대학원)",10081,"01","시민생활과법","김상일",3,3,2,"포B151","대면수업",100,20,80,""]
[null,3,"교양","글로벌의사소통","호크마교양대학",10098,"06","College English","오혜진",3,3,2,"학207","대면수업",30,16,14,"영어강의 비영어권 외국인반"]
[null,4,"교양","글로벌의사소통","호크마교양대학",10098,"01","College English","Brian D. Ridgeway",3,3,1,"학203","대면수업",30,19,11,"영어강의 사회계열(재수강자 및 4학기이상 이수자 중 미수강자) /  학점교류생수강불가"]
[null,5,"교양","글로벌의사소통","호크마교양대학",10098,"03","College English","성정혜",3,3,1,"학204","대면수업",30,22,8,"영어강의 자연계열(재수강자 및 4학기이상 이수자 중 미수강자) /  학점교류생수강불가"]
[null,6,"교양","글로벌의사소통","호크마교양대학",10098,"04","College English","성정혜",3,3,2,"학204","대면수업",30,25,5,"영어강의 자연계열(재수강자 및 4학기이상 이수자 중 미수강자) /  학점교류생수강불가"]
[null,7,"교양","글로벌의사소통","호크마교양대학",10098,"02","College English","고근영",3,3,2,"학203","대면수업",30,29,1,"영어강의 사회계열(재수강자 및 4학기이상 이수자 중 미수강자) /  학점교류생수강불가"]
[null,8,"교양","글로벌의사소통","호크마교양대학",10098,"05","College English","김명옥",3,3,2,"학205","대면수업",30,29,1,"영어강의 예체능계열(재수강자 및 4학기이상 이수자 중 미수강자) / 학점교류생수강불가"]
[null,9,"교양","글로벌의사소통","호크마교양대학",10099,"05","Advanced English","박현주",3,3,2,"학210","대면수업",30,7,23,"영어강의 비영어권 외국인반"]
[null,10,"교양","글로벌의사소통","호크마교양대학",10099,"01","Advanced English","이수경",3,3,2,"학208","대면수업",30,11,19,"영어강의 사회계열(재수강자 및 4학기이상 이수자 중 미수강자) /  학점교류생수강불가"]
[null,11,"교양","글로벌의사소통","호크마교양대학",10099,"04","Advanced English","HARRISON JOHN THOMAS GRANT",3,3,1,"학207","대면수업",30,29,1,"영어강의 인문계열(재수강자 및 4학기이상 이수자 중 미수강자) /  학점교류생수강불가"]
[null,12,"교양","핵심교양(역사와철학)","사학과",10149,"01","한국근현대사","송하연",3,3,2,"학654","대면수업",90,79,11,"수강불가 → 사학, 사학과"]
[null,13,"교양","일반교양(자유선택)","사학과",10158,"01","여성으로읽는한국사","정나영",3,3,2,"학652","대면수업",20,4,16,"영어강의 국제하계대학, 학점교류생 수강 불가"]
[null,14,"교양","핵심교양(예술과표현)","미술사학",10165,"01","현대미술사","강은주",3,3,1,"학511","대면수업",100,81,19,""]
[null,15,"교양","글로벌의사소통","호크마교양대학",10571,"01","기본스페인어","이은해",3,3,2,"학410","대면수업",31,28,3,""]
[null,16,"교양","일반교양(자유선택)","호크마교양대학",10647,"01","Practical English","이소영",3,"",2,"","대면수업",200,69,131,"영어강의 프로그램 신청서 접수 및 수강료(48만원) 납부 요망 / Speaking Master Program (SMaP)"]
[null,17,"교양","핵심교양(역사와철학)","여성학",10772,"01","여성과사회정의","김현영",3,3,2,"포153","대면수업",80,44,36,""]
[null,18,"교양","일반교양(자유선택)","국제교류팀(구 국제하계대학)",10820,"01","Gender Relations in Korea","조혜림",3,3,1,"캠B147","대면수업",2,0,2,"영어강의 국제하계대학, 학점교류생 수강불가"]
[null,19,"교양","핵심교양(인간과사회)","사회복지학과",10904,"01","우리사회의문제와쟁점찾기","이지언",3,3,1,"포253","대면수업",40,34,6,""]
[null,20,"교양","일반교양(자유선택)","교육학과",10952,"01","Introductory Psychology in Education","오인수",3,3,"","","원격수업",200,64,136,"영어강의"]
[null,21,"교양","일반교양(자유선택)","교육학과",10962,"01","Introduction to Counseling","오인수",3,3,"","","원격수업",200,91,109,"영어강의"]
[null,22,"교양","일반교양(자유선택)","국제교류팀(구 국제하계대학)",11007,"01","Contemporary Korean Cinema","곽영빈",3,3,1,"포361","대면수업",10,0,10,"영어강의 국제하계대학, 학점교류생 수강불가"]
[null,23,"교양","일반교양(자유선택)","국제교류팀(구 국제하계대학)",11018,"01","Hallyu in Global Contexts","윤호영",3,3,2,"포358","대면수업",10,1,9,"영어강의 국제하계대학, 학점교류생 수강불가, 국제하계대학 강의는 2교시를 13:00~15:30에 진행"]
[null,24,"교양","글로벌의사소통","중어중문학과",11036,"01","중국어Ⅰ","이수정",2,3,2,"학105","대면수업",30,7,23,""]
[null,25,"교양","핵심교양(인간과사회)","특수교육과",11079,"01","장애와사회","김유진",3,3,2,"교B254","대면수업",52,48,4,""]
[null,26,"교양","일반교양(자유선택)","국제학과(국제대학원)",11118,"01","Special Topics on Korean Culture","Nicholas Hensley Harkness",3,3,"","","대면수업",10,8,2,"영어강의 월~목 10시~1시 국1002, Ewha-Harvard Summer(7/24~8/14), 사전선발생만 수강가능"]
[null,27,"교양","일반교양(자유선택)","국제교류팀(구 국제하계대학)",11120,"01","Cross-Cultural Psychology","윤선영",3,3,1,"포360","대면수업",5,0,5,"영어강의 국제하계대학, 학점교류생 수강불가"]
[{"$f":"F31&G31","v":"1113201"},28,"교양","일반교양(자유선택)","호크마교양대학",11132,"01","고급영어글쓰기","이소영",3,"",1,"","대면수업",100,16,84,"영어강의 프로그램 신청서 접수 및 수강료(48만원) 납부 요망 /Ewha Writing Intensive School (EWIS)"]
[{"$f":"F32&G32","v":"1121001"},29,"교양","핵심교양(인간과사회)","국어교육과",11210,"01","교육커뮤니케이션의이해와실제","엄인영",3,3,2,"학409","대면수업",48,24,24,""]
["1123301",30,"교양","컴퓨팅과수리적사고","작곡과",11233,"01","음악테크놀로지와프로그래밍","전현석",3,3,1,"학551","대면수업",90,71,19,""]
["1131701",31,"교양","일반교양(자유선택)","국제교류팀(구 국제하계대학)",11317,"01","Intercultural Communications","임동진",3,3,1,"포357","대면수업",10,1,9,"영어강의 국제하계대학, 학점교류생 수강불가"]
["1134301",32,"교양","일반교양(자유선택)","국제교류팀(구 국제하계대학)",11343,"01","Cinema, Culture, and History","민자영",3,3,2,"포359","대면수업",10,1,9,"영어강의 국제하계대학, 학점교류생 수강불가, 국제하계대학 강의는 2교시를 13:00~15:30에 진행"]
["1134901",33,"교양","이화진선미","호크마교양대학",11349,"01","나눔과공존의리더십","이숙진",3,3,1,"학854","대면수업",40,21,19,""]
["1135201",34,"교양","사고와표현","호크마교양대학",11352,"01","통합적사고와글쓰기","박소영",3,3,1,"학503","대면수업",35,21,14,"외국인 분반(TOPIK 3급 이하) / 한국인 및 재외국민 수강 불가"]
["1135202",35,"교양","사고와표현","호크마교양대학",11352,"02","통합적사고와글쓰기","한정미",3,3,1,"학504","대면수업",35,33,2,"외국인 분반(TOPIK 4급 이상) / 한국인 및 재외국민 수강 불가"]
["1138001",36,"교양","일반교양(미래설계)","학생군사교육단",11380,"01","전투지휘학II","이명건",1,"","","","대면수업",30,22,8,"추가개설, 학군사관 후보생 외 수강불가"]
["1138401",37,"교양","일반교양(자유선택)","국제교류팀(구 국제하계대학)",11384,"01","North Korea: Between Continuity and Change","김화정",3,3,2,"포360","대면수업",10,3,7,"영어강의 국제하계대학, 학점교류생 수강불가, 국제하계대학 강의는 2교시를 13:00~15:30에 진행"]
["1138501",38,"교양","컴퓨팅과수리적사고","사회복지학과",11385,"01","데이터과학적사고와사회문제해결과정","이지언",3,3,2,"포159","대면수업",40,20,20,""]
["1148701",39,"교양","일반교양(자유선택)","국제교류팀(구 국제하계대학)",11487,"01","Criminal Psychology: Exploring the Mind of Criminals","윤선영",3,3,2,"포361","대면수업",2,1,1,"영어강의 국제하계대학, 학점교류생 수강불가, 국제하계대학 강의는 2교시를 13:00~15:30에 진행"]
["1148901",40,"교양","일반교양(자유선택)","국제교류팀(구 국제하계대학)",11489,"01","Art and the City: Exploring Asian Art in Seoul","권민호",3,3,2,"포362","대면수업",10,0,10,"영어강의 국제하계대학, 학점교류생 수강불가, 국제하계대학 강의는 2교시를 13:00~15:30에 진행"]
["1149201",41,"교양","일반교양(자유선택)","국제교류팀(구 국제하계대학)",11492,"01","Music in Wellness","유가을",3,3,1,"포356","대면수업",10,0,10,"영어강의 국제하계대학, 학점교류생 수강불가"]
["1149401",42,"교양","일반교양(자유선택)","국제교류팀(구 국제하계대학)",11494,"01","Contemporary Issues in Korean Culture","김화정",3,3,1,"포358","대면수업",10,2,8,"영어강의 국제하계대학, 학점교류생 수강불가"]
["1153201",43,"교양","일반교양(자유선택)","국제교류팀(구 국제하계대학)",11532,"01","Architecture and the City","안미혜",3,3,2,"포365","대면수업",10,0,10,"영어강의 국제하계대학, 학점교류생 수강불가, 국제하계대학 강의는 2교시를 13:00~15:30에 진행"]
["1153301",44,"교양","일반교양(자유선택)","국제교류팀(구 국제하계대학)",11533,"01","Music and the City","오세린",3,3,2,"포366","대면수업",10,0,10,"영어강의 국제하계대학, 학점교류생 수강불가, 국제하계대학 강의는 2교시를 13:00~15:30에 진행"]
["2000801",45,"비사대교직","","교육학과",20008,"01","교육철학및교육사","신정민",2,2,1,"교B154","대면수업",17,14,3,""]
["2020601",46,"전공선택","","철학과",20206,"01","사회정치철학","이지영",3,3,2,"학510","대면수업",100,12,88,""]
["2040601",47,"전공기초","","수학과",20406,"01","미분적분학","하구용",3,3,1,"종AB101","대면수업",60,59,1,"졸업예정자 수강불가"]
["2040901",48,"전공기초","","물리학과",20409,"01","일반물리학Ⅰ","마경주",3,3,2,"포464","대면수업",60,22,38,""]
["2041001",49,"전공기초","","물리학과",20410,"01","일반물리학실험Ⅰ","조화연",1,1.5,1,"종B301","대면수업",23,17,6,"영어강의"]
["2041601",50,"전공기초","","화학·나노과학과",20416,"01","일반화학Ⅰ","차선신",3,3,2,"포261","대면수업",70,62,8,""]
["2041701",51,"전공기초","","화학·나노과학과",20417,"01","일반화학Ⅱ","최한",3,3,1,"포261","대면수업",60,37,23,""]
["2042501",52,"전공기초","","통계학과",20425,"01","통계학Ⅱ","문온",3,3,2,"포357","대면수업",50,47,3,"학점교류생 수강불가"]
["2048101",53,"전공필수","","컴퓨터공학과",20481,"01","자료구조","이경은",3,3,2,"공학A103","대면수업",31,25,6,"전공필수 학점교류생 수강불가"]
["2087001",54,"전공필수","","한국음악과",20870,"01","Korean Music Analysis and Composition Ⅱ","유민희",2,2,1,"음328","대면수업",30,14,16,"전공필수,영어강의 전공필수, 학점교류생 수강불가"]
["2153101",55,"전공선택","","유아교육과",21531,"01","유아교육과정","곽진이",3,3,1,"교B254","대면수업",20,13,7,"특수교육과 유아특수교육전공 학생들만 수강 가능/ 학점교류생 수강 불가"]
["2159101",56,"전공선택","","심리학과",21591,"01","발달심리학","이순행",3,3,1,"포359","대면수업",30,17,13,"추가개설"]
["2223301",57,"전공기초","","경영학부",22233,"01","경영통계학","곽진경",3,3,"","","원격수업",200,71,129,"원격수업, 시험은 오프라인 (7/10, 7/23 11am-12pm 예정)"]
{"$rows_left_out":91}
{"sheet":" 원본","index":1,"n_rows":202,"n_cols":19,"rows_kept":202,"cut":false,"hidden":true,"merged":[[0,1,0,17]]}
[null,"2025학년도 여름 계절학기 잔여석 현황"]
[{"$nulls":17},"2024.6.23. 10:20"]
["학수번호분반","ks","교과목구분","교과목영역","개설학과/전공","학수번호","분반","교과목명","교수명","학점","시간","교시","강의실","수업유형","본교생\n제한인원","본교생\n수강인원","본교생\n잔여석","비고","비고"]
[{"$f":"F4&G4","v":"3771501"},3,"전공선택","","국어국문학과",37715,"01","현장실습Ⅱ","연남경",6,"",null,null,"대면수업",{"$f":"VLOOKUP(A4,[1]작업1!$E$2:$N$183,5,0)","v":1},{"$f":"VLOOKUP(A4,[1]작업1!$E$1:$N$183,10,0)","v":0},{"$f":"O4-P4","v":1},"추가개설, 인턴십, 사전 선발생만 수강가능 학점교류생, 졸업예정자 수강불가"]
["3772201",4,"전공선택","","불어불문학과",37722,"01","불어불문학인턴십Ⅰ","Emmanuel Nicolas",1,"",null,null,"대면수업",{"$f":"VLOOKUP(A5,[1]작업1!$E$2:$N$183,5,0)","v":2},{"$f":"VLOOKUP(A5,[1]작업1!$E$1:$N$183,10,0)","v":0},{"$f":"O5-P5","v":2},"추가개설, 인턴십, 사전 선발생만 수강가능 학점교류생, 졸업예정자 수강불가"]
["3773801",5,"전공선택","","소비자학과",37738,"01","소비자학인턴십Ⅰ","최혜경",1,"",null,null,"대면수업",{"$f":"VLOOKUP(A6,[1]작업1!$E$2:$N$183,5,0)","v":1},{"$f":"VLOOKUP(A6,[1]작업1!$E$1:$N$183,10,0)","v":0},1,"추가개설, 사전 선발생만 수강 가능"]
["3776801",6,"전공선택","","의류산업학과",37768,"01","패션현장실무인턴십Ⅲ","강서영",3,"",null,null,"대면수업",{"$f":"VLOOKUP(A7,[1]작업1!$E$2:$N$183,5,0)","v":25},{"$f":"VLOOKUP(A7,[1]작업1!$E$1:$N$183,10,0)","v":1},24,"추가개설, 인턴십, 사전 선발생만 수강가능 학점교류생, 졸업예정자 수강불가"]
["3794501",7,"전공선택","","커뮤니케이션·미디어학부",37945,"01","커뮤니케이션현장실습1","유승철",1,"",null,null,"대면수업",{"$f":"VLOOKUP(A8,[1]작업1!$E$2:$N$183,5,0)","v":1},{"$f":"VLOOKUP(A8,[1]작업1!$E$1:$N$183,10,0)","v":0},1,"추가개설, 사전 선발생만 수강 가능"]
["3794601",8,"전공선택","","커뮤니케이션·미디어학부",37946,"01","커뮤니케이션현장실습2","유승철",2,"",null,null,"대면수업",{"$f":"VLOOKUP(A9,[1]작업1!$E$2:$N$183,5,0)","v":1},{"$f":"VLOOKUP(A9,[1]작업1!$E$1:$N$183,10,0)","v":0},1,"추가개설, 사전 선발생만 수강 가능"]
["3801801",9,"전공선택","","융합콘텐츠학과",38018,"01","융합콘텐츠인턴십Ⅲ","한혜원",3,"",null,null,"대면수업",{"$f":"VLOOKUP(A10,[1]작업1!$E$2:$N$183,5,0)","v":2},{"$f":"VLOOKUP(A10,[1]작업1!$E$1:$N$183,10,0)","v":0},2,"추가개설, 인턴십(전공)/ 전공 학점 인정 여부는 개강 전 학과의 인턴십 서류 심사로 결정됨/ 사전 승인되지 않은 학생은 수강 신청 불가함"]
["3836001",10,"전공선택","","컴퓨터공학과",38360,"01","컴퓨터공학중기인턴십Ⅰ","김규호",3,"",null,null,"대면수업",{"$f":"VLOOKUP(A11,[1]작업1!$E$2:$N$183,5,0)","v":20},{"$f":"VLOOKUP(A11,[1]작업1!$E$1:$N$183,10,0)","v":0},20,"추가개설, 인턴십, 사전선발생만수강가능,  협약 체결 기관만 학점인정가능,  학점교류생/졸업예정자 수강불가"]
["3836201",11,"전공선택","","컴퓨터공학과",38362,"01","컴퓨터공학중기인턴십Ⅲ","김규호",3,"",null,null,"대면수업",{"$f":"VLOOKUP(A12,[1]작업1!$E$2:$N$183,5,0)","v":20},{"$f":"VLOOKUP(A12,[1]작업1!$E$1:$N$183,10,0)","v":0},20,"추가개설, 인턴십, 사전선발생만수강가능,  협약 체결 기관만 학점인정가능,  학점교류생/졸업예정자 수강불가"]
["3850701",12,"전공선택","","사이버보안학과",38507,"01","사이버보안중기인턴십Ⅰ","유광현",3,"",null,null,"대면수업",{"$f":"VLOOKUP(A13,[1]작업1!$E$2:$N$183,5,0)","v":15},{"$f":"VLOOKUP(A13,[1]작업1!$E$1:$N$183,10,0)","v":0},15,"추가개설, 인턴십, 사전선발생만수강가능,  협약 체결 기관만 학점인정가능,  학점교류생/졸업예정자 수강불가"]
["3863001",13,"전공선택","","소비자학과",38630,"01","소비자학인턴십Ⅱ","최혜경",2,"",null,null,"대면수업",{"$f":"VLOOKUP(A14,[1]작업1!$E$2:$N$183,5,0)","v":1},{"$f":"VLOOKUP(A14,[1]작업1!$E$1:$N$183,10,0)","v":0},1,"추가개설, 사전 선발생만 수강 가능"]
["3866601",14,"전공선택","","컴퓨터공학과",38666,"01","컴퓨터공학단기인턴십Ⅳ","김규호",2,"",null,null,"대면수업",{"$f":"VLOOKUP(A15,[1]작업1!$E$2:$N$183,5,0)","v":20},{"$f":"VLOOKUP(A15,[1]작업1!$E$1:$N$183,10,0)","v":0},20,"추가개설, 인턴십, 사전선발생만수강가능,  협약 체결 기관만 학점인정가능,  학점교류생/졸업예정자 수강불가"]
["C055301",15,"일반선택","","연세대","C0553","01","철학과윤리(연대)","",3,3,null,null,"대면수업",{"$f":"VLOOKUP(A16,[1]작업1!$E$2:$N$183,5,0)","v":1},{"$f":"VLOOKUP(A16,[1]작업1!$E$1:$N$183,10,0)","v":0},1,""]
["C120601",16,"일반선택","","연세대","C1206","01","창업107:창업시뮬레이션(연대)","",1,1,null,null,"대면수업",{"$f":"VLOOKUP(A17,[1]작업1!$E$2:$N$183,5,0)","v":1},{"$f":"VLOOKUP(A17,[1]작업1!$E$1:$N$183,10,0)","v":0},1,""]
["H056401",17,"일반선택","","서울대학교","H0564","01","대중예술의이해(서울대)","",3,3,null,null,"대면수업",{"$f":"VLOOKUP(A18,[1]작업1!$E$2:$N$183,5,0)","v":1},{"$f":"VLOOKUP(A18,[1]작업1!$E$1:$N$183,10,0)","v":0},1,""]
["X000101",18,"일반선택","","경희대학교","X0001","01","경영학원론(경희대)","",3,3,null,null,"대면수업",{"$f":"VLOOKUP(A19,[1]작업1!$E$2:$N$183,5,0)","v":1},{"$f":"VLOOKUP(A19,[1]작업1!$E$1:$N$183,10,0)","v":0},1,""]
["3837701",19,"전공선택","","식품생명공학과",38377,"01","식품산업현장심화실습Ⅰ","도한솔",3,"","","","대면수업",{"$f":"VLOOKUP(A20,[1]작업1!$E$2:$N$183,5,0)","v":10},{"$f":"VLOOKUP(A20,[1]작업1!$E$1:$N$183,10,0)","v":0},10,"추가개설, 현장실습 과목, 학점교류생수강불가"]
["3936201",20,"전공선택","","공간디자인",39362,"01","공간디자인인턴십Ⅲ","이지은",3,3,"","","대면수업",{"$f":"VLOOKUP(A21,[1]작업1!$E$2:$N$183,5,0)","v":20},{"$f":"VLOOKUP(A21,[1]작업1!$E$1:$N$183,10,0)","v":0},20,"인턴십, 사전 선발생만 수강 가능, 학점교류생/졸업예정자 수강불가"]
["3412601",21,"전공기초","","동양화",34126,"01","드로잉","서은애",2,3,1,"조형A508","대면수업",{"$f":"VLOOKUP(A22,[1]작업1!$E$2:$N$183,5,0)","v":10},{"$f":"VLOOKUP(A22,[1]작업1!$E$1:$N$183,10,0)","v":1},9,"추가개설"]
["3551101",22,"전공선택(교직)","","컴퓨터공학과",35511,"01","정보.컴퓨터교과교재연구및지도법","안영아",3,3,1,"공학A124","대면수업",{"$f":"VLOOKUP(A23,[1]작업1!$E$2:$N$183,5,0)","v":15},{"$f":"VLOOKUP(A23,[1]작업1!$E$1:$N$183,10,0)","v":2},13,"추가개설, 학점교류생 수강불가, 교직과정 교과목"]
["3562201",23,"전공선택(교직)","","컴퓨터공학과",35622,"01","정보.컴퓨터교과교육론","양숙희",3,3,2,"공학A124","대면수업",{"$f":"VLOOKUP(A24,[1]작업1!$E$2:$N$183,5,0)","v":15},{"$f":"VLOOKUP(A24,[1]작업1!$E$1:$N$183,10,0)","v":4},11,"추가개설, 학점교류생 수강불가, 교직과정 교과목"]
["3868201",24,"전공선택","","화공신소재공학과",38682,"01","화공신소재공학고급실험Ⅱ","황혜림",1,1.5,"","","대면수업",{"$f":"VLOOKUP(A25,[1]작업1!$E$2:$N$183,5,0)","v":60},{"$f":"VLOOKUP(A25,[1]작업1!$E$1:$N$183,10,0)","v":6},54,"추가개설, 사전선발생만 수강가능, 학점교류생수강불가"]
["1009905",25,"교양","글로벌의사소통","호크마교양대학",10099,"05","Advanced English","박현주",3,3,2,"학210","대면수업",{"$f":"VLOOKUP(A26,[1]작업1!$E$2:$N$183,5,0)","v":30},{"$f":"VLOOKUP(A26,[1]작업1!$E$1:$N$183,10,0)","v":7},23,"영어강의 비영어권 외국인반"]
["1103601",26,"교양","글로벌의사소통","중어중문학과",11036,"01","중국어Ⅰ","이수정",2,3,2,"학105","대면수업",{"$f":"VLOOKUP(A27,[1]작업1!$E$2:$N$183,5,0)","v":30},{"$f":"VLOOKUP(A27,[1]작업1!$E$1:$N$183,10,0)","v":7},23,""]
["3349701",27,"전공기초","","사회과학대학",33497,"01","사회과학고전읽기","김미주",3,3,2,"포161","대면수업",{"$f":"VLOOKUP(A28,[1]작업1!$E$2:$N$183,5,0)","v":90},{"$f":"VLOOKUP(A28,[1]작업1!$E$1:$N$183,10,0)","v":9},81,"사회대 4학년용(~19학번) 전공기초 교과목(20학번부터는 수강시 졸업학점으로만 포함됨)"]
["3951501",28,"전공선택","","간호학부",39515,"01","해외간호현장탐방","차지영",1,1.5,"","","대면수업",{"$f":"VLOOKUP(A29,[1]작업1!$E$2:$N$183,5,0)","v":10},{"$f":"VLOOKUP(A29,[1]작업1!$E$1:$N$183,10,0)","v":9},1,"추가개설, 2025 상반기 교수인솔 해외학습 프로그램 참가 사전선발생만 수강가능, 졸업예정자 수강불가, 학점교류생 수강불가"]
["1050401",29,"교양","일반교양(자유선택)","도자예술",10504,"01","Korean Ceramics I","이지현",3,3,1,"조형B203","대면수업",{"$f":"VLOOKUP(A30,[1]작업1!$E$2:$N$183,5,0)","v":0},{"$f":"VLOOKUP(A30,[1]작업1!$E$1:$N$183,10,0)","v":0},0,"영어강의 국제하계대학, 본교생 및 학점교류생 수강 불가","잔여석 삭제불가_국제교(본교생제한0)"]
["1050402",30,"교양","일반교양(자유선택)","도자예술",10504,"02","Korean Ceramics I","김현아",3,3,2,"조형B203","대면수업",{"$f":"VLOOKUP(A31,[1]작업1!$E$2:$N$183,5,0)","v":0},{"$f":"VLOOKUP(A31,[1]작업1!$E$1:$N$183,10,0)","v":0},0,"영어강의 국제하계대학, 본교생 및 학점교류생 수강 불가, 국제하계대학 강의는 2교시를 13:00~15:30에 진행","잔여석 삭제불가_국제교(본교생제한0)"]
["1147301",31,"교양","일반교양(미래설계)","현장실습지원센터",11473,"01","이화커리어현장실습(계절)1","서선희",3,"","","","대면수업",{"$f":"VLOOKUP(A32,[1]작업1!$E$2:$N$183,5,0)","v":0},{"$f":"VLOOKUP(A32,[1]작업1!$E$1:$N$183,10,0)","v":0},0,"국내 4~5주 실습, 수강철회불가, 학생 직접 수강신청 불가(현장실습지원센터의 현장실습 참여자 대상 교과목)","잔여석 삭제불가_국제교(본교생제한0)"]
["1147401",32,"교양","일반교양(미래설계)","현장실습지원센터",11474,"01","이화커리어현장실습(계절)2","서선희",4,"","","","대면수업",{"$f":"VLOOKUP(A33,[1]작업1!$E$2:$N$183,5,0)","v":0},{"$f":"VLOOKUP(A33,[1]작업1!$E$1:$N$183,10,0)","v":0},0,"국내 6~7주 실습, 수강철회불가, 학생 직접 수강신청 불가(현장실습지원센터의 현장실습 참여자 대상 교과목)","잔여석 삭제불가_국제교(본교생제한0)"]
["1147501",33,"교양","일반교양(미래설계)","현장실습지원센터",11475,"01","이화커리어현장실습(계절)3","서선희",6,"","","","대면수업",{"$f":"VLOOKUP(A34,[1]작업1!$E$2:$N$183,5,0)","v":0},{"$f":"VLOOKUP(A34,[1]작업1!$E$1:$N$183,10,0)","v":0},0,"국내 8~11주 실습, 수강철회불가, 학생 직접 수강신청 불가(현장실습지원센터의 현장실습 참여자 대상 교과목)","잔여석 삭제불가_국제교(본교생제한0)"]
["1147601",34,"교양","일반교양(미래설계)","인재개발원",11476,"01","글로벌인턴십1","서선희",3,"","","","대면수업",{"$f":"VLOOKUP(A35,[1]작업1!$E$2:$N$183,5,0)","v":0},{"$f":"VLOOKUP(A35,[1]작업1!$E$1:$N$183,10,0)","v":0},0,"해외 4~5주, 인턴십 수행 후 1년 이내 승인학생, 수강철회불가,  학생 직접 수강신청 불가","잔여석 삭제불가_국제교(본교생제한0)"]
["1147701",35,"교양","일반교양(미래설계)","인재개발원",11477,"01","글로벌인턴십2","서선희",4,"","","","대면수업",{"$f":"VLOOKUP(A36,[1]작업1!$E$2:$N$183,5,0)","v":0},{"$f":"VLOOKUP(A36,[1]작업1!$E$1:$N$183,10,0)","v":0},0,"해외 6~7주, 인턴십 수행 후 1년 이내 승인학생, 수강철회불가,  학생 직접 수강신청 불가","잔여석 삭제불가_국제교(본교생제한0)"]
["1147801",36,"교양","일반교양(미래설계)","인재개발원",11478,"01","글로벌인턴십3","서선희",6,"","","","대면수업",{"$f":"VLOOKUP(A37,[1]작업1!$E$2:$N$183,5,0)","v":0},{"$f":"VLOOKUP(A37,[1]작업1!$E$1:$N$183,10,0)","v":0},0,"해외 8~11주, 인턴십 수행 후 1년 이내 승인학생, 수강철회불가,  학생 직접 수강신청 불가","잔여석 삭제불가_국제교(본교생제한0)"]
["1148101",37,"교양","일반교양(미래설계)","인재개발원",11481,"01","글로벌인턴십6","서선희",1,"","","","대면수업",{"$f":"VLOOKUP(A38,[1]작업1!$E$2:$N$183,5,0)","v":0},{"$f":"VLOOKUP(A38,[1]작업1!$E$1:$N$183,10,0)","v":0},0,"해외 4주, 인턴십 수행 후 1년 이내 승인학생, 수강철회불가,  학생 직접 수강신청 불가","잔여석 삭제불가_국제교(본교생제한0)"]
["3482902",38,"전공필수","","건반악기과",34829,"02","건반악기전공실기Ⅵ","박옥주",2,3,1,null,"대면수업",{"$f":"VLOOKUP(A39,[1]작업1!$E$2:$N$183,5,0)","v":1},{"$f":"VLOOKUP(A39,[1]작업1!$E$1:$N$183,10,0)","v":1},0,"전공필수 추가개설"]
["3482501",39,"전공필수","","건반악기과",34825,"01","건반악기전공실기Ⅱ","이선호",2,3,1,"","대면수업",{"$f":"VLOOKUP(A40,[1]작업1!$E$2:$N$183,5,0)","v":1},{"$f":"VLOOKUP(A40,[1]작업1!$E$1:$N$183,10,0)","v":1},0,"전공필수 추가개설"]
["3484201",40,"전공필수","","성악과",34842,"01","성악전공실기Ⅲ","우수연",2,3,1,"","대면수업",{"$f":"VLOOKUP(A41,[1]작업1!$E$2:$N$183,5,0)","v":1},{"$f":"VLOOKUP(A41,[1]작업1!$E$1:$N$183,10,0)","v":1},0,"전공필수 추가개설"]
["3889101",41,"전공선택","","휴먼기계바이오공학과",38891,"01","휴먼기계바이오공학산학연계중기인턴십Ⅰ","이상륜",3,"","","","대면수업",{"$f":"VLOOKUP(A42,[1]작업1!$E$2:$N$183,5,0)","v":10},{"$f":"VLOOKUP(A42,[1]작업1!$E$1:$N$183,10,0)","v":1},9,"인턴십, 사전선발생만수강가능, 협약 체결 기관만 학점인정가능, 학점교류생/졸업예정자 수강불가"]
["C111901",42,"일반선택","","연세대","C1119","01","미시경제학(연세대)","",3,3,"","","대면수업",{"$f":"VLOOKUP(A43,[1]작업1!$E$2:$N$183,5,0)","v":1},{"$f":"VLOOKUP(A43,[1]작업1!$E$1:$N$183,10,0)","v":1},0,""]
["H009401",43,"일반선택","","서울대학교","H0094","01","미시경제이론(서울대)","",3,3,"","","대면수업",{"$f":"VLOOKUP(A44,[1]작업1!$E$2:$N$183,5,0)","v":1},{"$f":"VLOOKUP(A44,[1]작업1!$E$1:$N$183,10,0)","v":1},0,""]
["H034201",44,"일반선택","","서울대학교","H0342","01","교육사회(서울대)","",2,2,"","","대면수업",{"$f":"VLOOKUP(A45,[1]작업1!$E$2:$N$183,5,0)","v":1},{"$f":"VLOOKUP(A45,[1]작업1!$E$1:$N$183,10,0)","v":1},0,""]
["H057301",45,"일반선택","","서울대학교","H0573","01","창작의세계(서울대)","",3,3,"","","대면수업",{"$f":"VLOOKUP(A46,[1]작업1!$E$2:$N$183,5,0)","v":1},{"$f":"VLOOKUP(A46,[1]작업1!$E$1:$N$183,10,0)","v":1},0,""]
["H057401",46,"일반선택","","서울대학교","H0574","01","철학개론(서울대)","",3,3,"","","대면수업",{"$f":"VLOOKUP(A47,[1]작업1!$E$2:$N$183,5,0)","v":1},{"$f":"VLOOKUP(A47,[1]작업1!$E$1:$N$183,10,0)","v":1},0,""]
["H057501",47,"일반선택","","서울대학교","H0575","01","테니스초급(서울대)","",1,1,"","","대면수업",{"$f":"VLOOKUP(A48,[1]작업1!$E$2:$N$183,5,0)","v":1},{"$f":"VLOOKUP(A48,[1]작업1!$E$1:$N$183,10,0)","v":1},0,""]
["H057701",48,"일반선택","","서울대학교","H0577","01","과학의철학적이해(서울대)","",3,3,"","","대면수업",{"$f":"VLOOKUP(A49,[1]작업1!$E$2:$N$183,5,0)","v":1},{"$f":"VLOOKUP(A49,[1]작업1!$E$1:$N$183,10,0)","v":1},0,""]
["H057801",49,"일반선택","","서울대학교","H0578","01","인간관계의심리학(서울대)","",3,3,"","","대면수업",{"$f":"VLOOKUP(A50,[1]작업1!$E$2:$N$183,5,0)","v":1},{"$f":"VLOOKUP(A50,[1]작업1!$E$1:$N$183,10,0)","v":1},0,""]
["3730801",50,"전공선택","","건축학과",37308,"01","건축실무인턴십Ⅰ","박지현",1,"","","","대면수업",{"$f":"VLOOKUP(A51,[1]작업1!$E$2:$N$183,5,0)","v":30},{"$f":"VLOOKUP(A51,[1]작업1!$E$1:$N$183,10,0)","v":2},28,"추가개설, 인턴십, 사전선발생만수강가능, 협약이 체결된 기업 인턴십만 학점 인정 가능, 졸업예정자/학점교류생 수강불가"]
["3889301",51,"전공선택","","휴먼기계바이오공학과",38893,"01","휴먼기계바이오공학산학연계중기인턴십Ⅲ","이상륜",3,"","","","대면수업",{"$f":"VLOOKUP(A52,[1]작업1!$E$2:$N$183,5,0)","v":10},{"$f":"VLOOKUP(A52,[1]작업1!$E$1:$N$183,10,0)","v":2},8,"인턴십, 사전선발생만수강가능, 협약 체결 기관만 학점인정가능, 학점교류생/졸업예정자 수강불가"]
["1153201",52,"교양","일반교양(자유선택)","국제교류팀(구 국제하계대학)",11532,"01","Architecture and the City","안미혜",3,3,2,"포365","대면수업",{"$f":"VLOOKUP(A53,[1]작업1!$E$2:$N$183,5,0)","v":10},{"$f":"VLOOKUP(A53,[1]작업1!$E$1:$N$183,10,0)","v":0},10,"영어강의 국제하계대학, 학점교류생 수강불가, 국제하계대학 강의는 2교시를 13:00~15:30에 진행"]
["3484101",53,"전공필수","","성악과",34841,"01","성악전공실기Ⅱ","우수연",2,3,1,"","대면수업",{"$f":"VLOOKUP(A54,[1]작업1!$E$2:$N$183,5,0)","v":3},{"$f":"VLOOKUP(A54,[1]작업1!$E$1:$N$183,10,0)","v":3},0,"전공필수 추가개설"]
["3784501",54,"전공선택","","건축도시시스템공학과",37845,"01","건축도시시스템인턴십Ⅰ","김단야",2,"","","","대면수업",{"$f":"VLOOKUP(A55,[1]작업1!$E$2:$N$183,5,0)","v":30},{"$f":"VLOOKUP(A55,[1]작업1!$E$1:$N$183,10,0)","v":3},27,"인턴십, 사전선발생만수강가능, 협약 체결 기관만 학점인정가능, 학점교류생/졸업예정자 수강불가"]
["3775801",55,"전공선택","","경영학부",37758,"01","경영학인턴십Ⅱ","박소라",2,"","","","대면수업",{"$f":"VLOOKUP(A56,[1]작업1!$E$2:$N$183,5,0)","v":50},{"$f":"VLOOKUP(A56,[1]작업1!$E$1:$N$183,10,0)","v":5},45,"인턴십, 사전선발생만수강가능, 학점교류생/졸업예정자 수강불가"]
["3902801",56,"전공선택","","미래산업약학",39028,"01","유전학과질환","이기현",1.5,1.5,2,"포367","융합수업",{"$f":"VLOOKUP(A57,[1]작업1!$E$2:$N$183,5,0)","v":10},{"$f":"VLOOKUP(A57,[1]작업1!$E$1:$N$183,10,0)","v":5},5,"영어강의 융합수업,  약학부 미래산업약학전공 학생 수강 약학전공 38923-01반과 합반"]
["1149201",57,"교양","일반교양(자유선택)","국제교류팀(구 국제하계대학)",11492,"01","Music in Wellness","유가을",3,3,1,"포356","대면수업",{"$f":"VLOOKUP(A58,[1]작업1!$E$2:$N$183,5,0)","v":10},{"$f":"VLOOKUP(A58,[1]작업1!$E$1:$N$183,10,0)","v":0},10,"영어강의 국제하계대학, 학점교류생 수강불가"]
["1134301",58,"교양","일반교양(자유선택)","국제교류팀(구 국제하계대학)",11343,"01","Cinema, Culture, and History","민자영",3,3,2,"포359","대면수업",{"$f":"VLOOKUP(A59,[1]작업1!$E$2:$N$183,5,0)","v":10},{"$f":"VLOOKUP(A59,[1]작업1!$E$1:$N$183,10,0)","v":1},9,"영어강의 국제하계대학, 학점교류생 수강불가, 국제하계대학 강의는 2교시를 13:00~15:30에 진행"]
["3868401",59,"전공선택","","기업가정신",38684,"01","스타트업인턴십Ⅰ","김창훈",2,"","","","대면수업",{"$f":"VLOOKUP(A60,[1]작업1!$E$2:$N$183,5,0)","v":15},{"$f":"VLOOKUP(A60,[1]작업1!$E$1:$N$183,10,0)","v":7},8,"인턴십, 사전선발생만수강가능, 학점교류생/졸업예정자수강불가"]
{"$rows_left_out":142}